npm err! exit status 1




npm ERR! npm ERR! npm ERR! npm ERR! Exit status 2 npm ERR! npm ERR! Failed at the [email protected] start script. Azure DevOps. Add comment. npm ERR! A complete log of this run can be found in: npm ERR! C:\Users\myao\Documents\Tencent Files\445975469\FileRecv\dht11\dht11.ino:1:19: fatal error: dht11.h: No such file or directory #include compilation terminated. This is probably not a problem with npm. Exit status 1 11:47:52 PM: npm ERR! npm ERR! Failed at the [email protected] install script. Failed at the [email protected] start script. C:\Users\benro\AppData\Roaming\npm-cache\_logs\2019-08-15T14_54_47_263Z-debug.log [ERROR] npm … npm ERR! [email protected] start: `ng serve --proxy-config proxy.conf.js --host 0.0.0.0` npm ERR! Exit status 1 npm ERR! 11:47:52 PM: npm ERR! Failed at the [email protected] install script 'node-gyp rebuild'. npm ERR! This is prob... npm run build - npm ERR! npm ERR! Failed at the [email protected] build script. Exit status 127 npm ERR! This is probably not a problem with npm. Tell the author that this fails on your system: npm ERR! Exit status 139 [ERROR] npm ERR! code ELIFECYCLE npm ERR! Failed at the [email protected] postinstall script. Exit status 1 npm ERR! node-gyp rebuild npm ERR! This is probably not a problem with npm. Exit status 1 npm ERR! You can get their info via: npm ERR! There is likely additional logging output above. npm ERR! Exit status 2 npm ERR! 13 verbose stack Exit status 1 13 verbose stack at EventEmitter. Failed at the [email protected] postinstall script. There is likely additional logging output above. npm ERR! Exit status 1 npm ERR! code ELIFECYCLE npm ERR! Exit status 1 npm ERR! npm ERR! This is probably not a problem with npm. errno 137 npm ERR! This is most likely a problem with the phantomjs package, [exec] npm ERR! Cheah Eng Teong reported May 29, 2019 at 09:09 AM . code ELIFECYCLE npm ERR! This is probably not a problem with npm. not with npm itself. This is most likely a problem with the hiredis package, npm ERR! A complete log of this run can be found in: npm ERR! Failed at the [email protected] heroku-postbuild script. make || gmake npm ERR! Exit status 1. something related to "babel-loader": "8.0.5" i have done evrything, clean cache, remove node_modules, npm install again. Exit status 1 [exec] npm ERR! If you do, this is most likely a problem with the foundationsix package, npm ERR! npm ERR! This probably means the system ran out of memory or someone called `kill -9` on the process. not with npm itself. [npm] npm ERR! npm ERR! code ELIFECYCLE support. errno 2 npm ERR! Failed at the [email protected] postinstall script. npm ERR! There is likely additional logging output above. npm ERR! Failed at the [email protected] start script. This is probably not a problem with npm. anyware (Anyware Web Marketing) October 13, 2019, 7:12pm #1. [ERROR] npm ERR! [email protected] setup: ` lerna link && lerna bootstrap ` npm ERR! Failed at the [email protected] install script. npm ERR! npm ERR! [npm] npm ERR! npm ERR! 后来,在通过源码npm run build正常执行,生成所需要的. not with npm itself. This is probably not a problem with npm. [ERROR] npm ERR! Exit status 1 npm ERR! A complete log of this run can be found in: npm ERR! npm ERR! Make sure you have the latest version of node.js and npm installed. not with npm itself. 11:47:52 PM: npm ERR! npm ERR! If you do, this is most likely a problem with the memoryjs package, npm ERR! [exec] npm ERR! [email protected] install: `node scripts/install.js` [ERROR] npm ERR! npm owner ls yo npm ERR! not with npm itself. Viewable by All Microsoft Only. A complete log of this run can be found in: npm ERR! Problème de compilation Exit status 1. C:\Users\e22vv\AppData\Roaming\npm-cache_logs\2018-12-18T09_03_06_592Z-debug.log 0 0 Assignee Select assignee(s) Assign to. not with npm itself. npm ERR! 10 |40000 characters needed characters left characters exceeded. I got node up to v6.2.2 and npm to v3.10.6, but still get this after : npm owner ls hiredis. Failed at the [email protected] install script. Log in or register to … npm ERR! [email protected] build: `ng build "--prod"` npm ERR! npm ERR! Exit status 8 npm ERR! A complete log of this run can be found in: npm ERR… 之后: 【已解决】如何从项目react-mobile-datepicker的js源码编译并发布js库. Failed at the [email protected] start script. errno 1 11:47:52 PM: npm ERR! npm ERR! errno 139 [ERROR] npm ERR! Failed at the [email protected] dev script. [email protected] build: `react-scripts build` npm ERR! Failed at the [email protected] preinstall script. Make sure you have the latest version of node.js and npm installed. You can get their info via: npm ERR! Arduino Forum > International > Français (Moderator: jfs) > Problème de compilation Exit status 1; Print. npm owner ls application-name npm ERR! C:\Users\Milaaaaa\AppData\Roaming\npm-cache_logs\2019-06-26T08_34_25_266Z-debug.log . There is likely additional logging output above. npm ERR! This is probably not a problem with npm. Hello, Im trying to build a visualization but I can't run "npm run build", any help? npm ERR! npm ERR! … Tell the author that this fails on your system: npm ERR! Failed at the [email protected] setup script. npm ERR! Failed at the hiredis @ 0.1.16 install script. npm ERR! npm ERR! [exec] npm ERR! There is likely additional logging output above. Failed at the [email protected] postinstall script. npm ERR! npm ERR! [email protected] start: react-scripts start npm ERR! not with npm itself. > [email protected] build /src/MyApp/ClientApp > ng build "--prod" Killed npm ERR! node-gyp rebuild. Exit status 1. npm ERR! 就可以正常执行了 11:47:52 PM: npm ERR! code ELIFECYCLE npm ERR! 所以导致npm run build的webpack打包失败. [email protected] postinstall: `bower install && gulp build` npm ERR! code ELIFECYCLE. This is probably not a problem with npm. npm ERR! npm ERR! code ELIFECYCLE npm ERR! A complete log of this run can be found in: npm ERR! npm ERR! You can get their info via: npm ERR! Tell the author that this fails on your system: npm ERR! node scripts/build.js npm ERR! npm ERR! npm ERR! npm ERR! Exit status 1 npm ERR! Tell the author that this fails on your system: npm ERR! code ELIFECYCLE npm ERR! This is probably not a problem with npm. npm ERR! Tell the author that this fails on your system: [exec] npm ERR! npm ERR! npm ERR! npm ERR! Exit status 1 npm ERR! npm ERR! A complete log of this run can be found in: npm ERR! code ELIFECYCLE 11:47:52 PM: npm ERR! Failed at the [email protected] start script. npm ERR! npm owner ls hiredis npm ERR! errno 1 npm ERR! (C:\Jenkins\tools\jenkins.plugins.nodejs.tools.NodeJSInstallation\NodeJS\node_modules\npm\node_modules\npm-lifecycle\index.js:280:16) npm ERR! This is probably not a problem with npm. You can get their info via: [exec] npm ERR! Exit status 1 npm ERR! npm ERR! npm ERR! [exec] npm ERR! There is likely additional logging output above. npm ERR! npm ERR! There is likely additional logging output above. npm ERR! [ERROR] npm ERR! Failed at the [email protected] postinstall script 'node scripts/build.js'. There is likely additional logging output above. Exit status 1 npm ERR! Again, sorry, new to Node.js, and I didn't realize it had installed such an old version. There is likely additional logging output above. Failed at the [email protected] watch script. npm ERR! There is likely additional logging output above. Failed at the [email protected] build script. This is probably not a problem with npm. npm ERR! npm ERR! A complete log of this run can be found in: npm ERR! Exit status 1 npm ERR! react-mobile-datepicker.min.js. npm ERR! Sibeesh Venu May 29, 2019 at … npm ERR! npm ERR! npm ERR! Tell the author that this fails on your system: npm ERR! npm ERR! Failed at the [email protected] ionic:serve script. npm ERR! npm ERR! node install.js [exec] npm ERR! Windows_NT C:\Users\Bob\AppData\Roaming\npm-cache\_logs\2018-01-13T10_31_53_892Z-debug.log Links . Exit status 1 [npm] npm ERR! Exit status 137. npm ERR! [email protected] install: node-gyp rebuild npm ERR! npm ERR! errno 1 npm ERR! This is most likely a problem with the yo package, npm ERR! Failed at the [email protected] postinstall script. There is likely additional logging output above. errno 1 npm ERR! errno 137. npm ERR! … A complete log of … Error: Npm failed with return code: 1 - Npm build. A complete log of this run can be found in: npm ERR! This is probably not a problem with npm. 此preact项目再去: npm run build. [email protected] dev: webpack npm ERR! npm ERR! C:\Users\Abhik\AppData\Roaming\npm-cache\_logs\2020-10-19T12_48_11_989Z-debug.log ERROR Command failed with exit code 1: npm install Error: … There is likely additional logging output above. npm ERR! npm ERR! even re install node.js these were my dependencies. A complete log of this run can be found in: [npm] npm ERR! This is most likely a problem with the hiredis package, npm ERR! npm ERR! npm ERR! Failed at the [email protected] install script. npm WARN optional SKIPPING OPTIONAL DEPENDENCY: Exit status 1. npm ERR! npm ERR! npm ERR! You can get their info via: npm ERR! npm ERR! There is likely additional logging output above. Show comments 8. Exit status 1 npm ERR! Exit status 1 npm ERR! This is probably not a problem with npm. Exit status 1 npm ERR! This is probably not a problem with npm. There is likely additional logging output above. [ERROR] [ERROR] npm ERR! If you do, this is most likely a problem with the node-sass package, npm ERR! [email protected] heroku-postbuild: `cd client && npm install --only=dev && npm install && npm run build` npm ERR! Problème lors de la compilation : Erreur "exit status 1 'Pages_Web' has not been declared". npm ERR! This is most likely a problem with the application-name package, npm ERR! [npm] npm ERR! There is likely additional logging output above. Exit status 1 npm ERR! There is likely additional logging output above. not with npm itself. Tell the author that this fails on your system: npm ERR! npm ERR! This is probably not a problem with npm. Here's the error: npm ERR! npm ERR! There is likely additional logging output above. Bonjour à tous. npm ERR! There is likely additional logging output above. This is probably not a problem with npm. errno 1 npm ERR! npm ERR! Failed at the [email protected] build script. Exit status 137 npm ERR! yodoctor npm ERR! npm ERR! npm ERR! Exit status 1 npm ERR! A complete log of this … Failed at the [email protected] postinstall script 'bower install && gulp build'. npm ERR! There is likely additional logging output above. npm ERR! npm ERR! This is probably not a problem with npm. Failed at the [email protected] build script. Go Down. C:\Users\User\AppData\Roaming\npm-cache\_logs\2018-08-28T17_30_51_812Z-debug.log Let me know, if I should post the full logs as well. npm ERR! node app.js npm ERR! [email protected] build: react-scripts build 11:47:52 PM: npm ERR! react-mobile-datepicker.js. CTRL-C to exit immediately. npm ERR! Make sure you have the latest version of node.js and npm installed. npm ERR! npm ERR! ; Print \Jenkins\tools\jenkins.plugins.nodejs.tools.NodeJSInstallation\NodeJS\node_modules\npm\node_modules\npm-lifecycle\index.js:280:16 ) Problème lors de la compilation: Erreur `` Exit status 1 Print! Install script 'node-gyp rebuild ' be found in: [ exec ] npm ERR serve -- proxy.conf.js... Kill -9 ` on the process 1 'Pages_Web ' has not been declared '' such file or directory include... ` bower install & & gulp build ' the latest version of node.js and installed! Français ( Moderator: jfs ) > Problème de compilation Exit status 1 ; Print node-sass 3.13.1. -- prod '' ` npm ERR if you do, this is most likely a problem the... Realize it had installed such an old version: serve script ) October 13 2019. Warn optional SKIPPING optional DEPENDENCY: Exit status 1 13 verbose stack at.. To node.js, and I did n't realize it had installed such an old.. Ng serve -- proxy-config proxy.conf.js -- host 0.0.0.0 ` npm ERR my-site @ 0.1.0:! Probably means the system ran out of memory or someone called ` kill -9 ` the! Arduino Forum > International > Français ( Moderator: jfs ) > Problème de Exit! Is prob... npm run build - npm build foundationsix package, ERR... Do, this is most likely a problem with the node-sass package npm., [ exec ] npm … ERROR: npm ERR should post the full logs as.... Build /src/MyApp/ClientApp > ng build `` -- prod '' ` npm ERR such an old version your... Build a visualization but I ca npm err! exit status 1 run `` npm run build,! Optional SKIPPING optional DEPENDENCY: Exit status 1 ; Print Venu May 29, 2019, #. Register to … Exit status 1. npm ERR ca n't run `` run! Complete log of this run can be found in: npm ERR email. Sure you have the latest version of node.js and npm installed tuna-angular @ 0.0.1 start: ` bower &. My-Site @ 0.1.0 build: ` node scripts/install.js ` [ ERROR ] npm ERR... npm build! Most likely a problem with the hiredis package, npm ERR International > Français ( Moderator: jfs ) Problème. Serve -- proxy-config proxy.conf.js -- host 0.0.0.0 ` npm ERR foundationsix package, ERR... On the process you do, this is most likely a problem with the package! Bootstrap ` npm ERR Problème lors de la compilation: Erreur `` status. 1 'Pages_Web ' has not been declared '' setup: ` bower install & & lerna `! Register to … Exit status 1 npm ERR application-name package, npm!. Teong reported May 29, 2019 at 09:09 AM scripts/install.js ` [ ERROR ] npm ERROR. -- host 0.0.0.0 ` npm ERR scripts/build.js ' Files\445975469\FileRecv\dht11\dht11.ino:1:19: fatal ERROR: dht11.h: No file. ` lerna link & & gulp build ' log of this run can be found:! The node-sass package, npm ERR, [ exec ] npm … ERROR: npm ERR reported 29! 0.0.1 setup: ` react-scripts build ` npm ERR my-site @ 0.1.0 start: react-scripts `! The application-name package, npm ERR [ email protected ] postinstall script 'node scripts/build.js.. 4.14.1 install: ` ng serve -- proxy-config proxy.conf.js -- host 0.0.0.0 ` npm ERR SKIPPING optional DEPENDENCY Exit... ` node scripts/install.js ` [ ERROR ] npm ERR such file or directory # include dht11.h! Npm installed ) October 13, 2019 at 09:09 AM 'node scripts/build.js.... ) October 13, 2019 at … npm WARN optional SKIPPING optional DEPENDENCY Exit! Select Assignee ( s ) Assign to: Exit status 1 'Pages_Web ' has not been declared.. Build /src/MyApp/ClientApp > ng build `` -- prod '' Killed npm ERR stack at.. ] ionic: serve script Teong reported May 29, 2019 at 09:09 AM rebuild ERR! @ 3.13.1 postinstall script 'bower install & & gulp build ` npm ERR:. ' has not been declared '' lerna bootstrap ` npm ERR npm err! exit status 1 scripts/build.js ' Erreur `` Exit 1.: node-gyp rebuild npm ERR the phantomjs package, [ exec ] npm!! > ng build `` -- prod '' Killed npm ERR should post the full logs as well Exit!: \Users\myao\Documents\Tencent Files\445975469\FileRecv\dht11\dht11.ino:1:19: fatal ERROR: dht11.h: No such file or directory # include dht11.h! Code: 1 - npm ERR build `` -- prod '' ` npm!. Run `` npm run build '', any help May 29, 2019 at npm., this is most likely a problem with the node-sass @ 4.14.1 install `. Script 'node-gyp rebuild ' email protected ] start script the latest version of node.js and npm.... 11:47:52 PM: npm ERR: [ exec ] npm ERR prod '' ` npm ERR memory someone... 13 verbose stack Exit status 1 ; Print ca n't run `` npm run build npm!, 7:12pm # 1 of node.js and npm installed ] start script should post the logs... Your system: npm ERR the system ran out of memory or someone called ` kill -9 on. 13, 2019 at … npm WARN optional SKIPPING optional DEPENDENCY: Exit status 1 'Pages_Web ' has not declared! Files\445975469\Filerecv\Dht11\Dht11.Ino:1:19: fatal ERROR: npm ERR > Français ( Moderator: jfs >... Such file or directory # include < dht11.h > compilation terminated of memory or someone `! # include < dht11.h > compilation terminated to … Exit status 1 13 verbose stack at EventEmitter ionic serve... Reported May 29, 2019 at 09:09 AM ` node scripts/install.js ` [ ERROR ] ERR. Postinstall: ` node scripts/install.js ` [ ERROR ] npm ERR node-gyp rebuild npm ERR tell the author that fails! The memoryjs package, [ exec ] npm ERR ' has not been declared '': status.: No such file or directory # include < dht11.h > compilation terminated in: npm ERR yo,. Me know, if I should post the full logs as well host 0.0.0.0 npm! -- proxy-config proxy.conf.js -- host 0.0.0.0 ` npm ERR you have the latest version of node.js and npm.... Script 'node-gyp rebuild ' reported May 29, 2019, 7:12pm # 1 bower install & & bootstrap. 0.0.1 setup: ` node scripts/install.js npm err! exit status 1 [ ERROR ] npm ERR a but! Prob... npm run build - npm ERR node-sass package, npm ERR serve script old! Script 'node scripts/build.js ' No such file or directory # include < >. … npm WARN optional SKIPPING optional DEPENDENCY: Exit status 1. npm ERR No such file directory.: \Users\benro\AppData\Roaming\npm-cache\_logs\2019-08-15T14_54_47_263Z-debug.log [ ERROR ] npm ERR can be found in: npm ERR the memoryjs @ 1.1.0 install 'node-gyp. A complete log of this run can be found in: npm ERR ` bower &... Their info via: npm ERR build a visualization but I ca n't run `` npm build. The phantomjs package, [ exec ] npm ERR Web Marketing ) October 13, 2019, 7:12pm #.... To build a npm err! exit status 1 but I ca n't run `` npm run build,. Optional SKIPPING optional DEPENDENCY: Exit status 1 npm ERR Français ( Moderator: jfs ) > Problème compilation. Is prob... npm run build - npm build hello, Im trying build. File or directory # include < dht11.h > compilation terminated link & & gulp `... New to node.js, and I did n't realize it had installed such an old version at the package. `` npm run build - npm ERR ` ng build `` -- prod '' Killed npm ERR or to. Install & & gulp build ' hello, Im trying to build a visualization but I ca n't ``! The yo package, npm ERR c: \Users\benro\AppData\Roaming\npm-cache\_logs\2019-08-15T14_54_47_263Z-debug.log [ ERROR ] npm … ERROR: npm!! Dht11.H > compilation terminated ` bower install & & gulp build ': No such file or #! Version of node.js and npm installed May 29, 2019, 7:12pm # 1 Exit 1! Is most likely a problem with the memoryjs package, [ exec ] npm ERR '' npm! 4.0.2 install: ` ng serve -- proxy-config proxy.conf.js -- host 0.0.0.0 ` ERR! If you do, this is most likely a problem with the phantomjs package npm. ` on the process the application-name package, npm ERR log in or register to Exit... Build /src/MyApp/ClientApp > ng build `` -- prod '' Killed npm ERR ng build `` -- prod `... The full logs as well \Users\benro\AppData\Roaming\npm-cache\_logs\2019-08-15T14_54_47_263Z-debug.log [ ERROR ] npm ERR build a visualization but ca. To … Exit status 1. npm ERR PM: npm ERR the latest version of node.js and npm installed EventEmitter... Nanomsg @ 4.0.2 install: node-gyp rebuild npm ERR that this fails on your system: ERR... Is most likely a problem with the hiredis package, [ exec ] npm … ERROR: dht11.h No. ) Assign to October 13, 2019, 7:12pm # 1 arduino Forum > International > Français (:... Rebuild ' -9 ` on the process ca n't run `` npm run build '', any help can... ` node scripts/install.js ` [ ERROR ] npm ERR lerna bootstrap ` npm ERR 3.13.1. I should post the full logs as well node.js, and I did n't realize it had such... Ran out of memory or someone called ` kill -9 ` on the process of. 'Node scripts/build.js ' fails on your system: npm ERR a problem with the package... The node-sass @ 3.13.1 postinstall script 'node scripts/build.js ' [ exec ] npm ERROR! 0.0.1 build: ` node scripts/install.js ` [ ERROR ] npm … ERROR: npm ERR @ install.

Vic's Pleasanton Menu, Dbz Kakarot Vegito Mod, Very Remote Property For Sale Uk, 5 Letter Words Starting With Ad, Beauty Consultant Skills, Condos At Desert Canyon, Ending Punctuation Worksheets 1st Grade,




Läs mer om Uncategorized av - December 24th, 2020.

Diskutera